Target
Beta-lactamase
Ligand
BDBM93536
Substrate
IC50
16809±n/a nM
Citation
 PubChem, PC Counterscreen for inhibitors of the interaction of nucleotide-binding oligomerization domain containing 2 (NOD2) and receptor-interacting serine-threonine kinase 2 (RIPK2) PubChem Bioassay (2012)[AID] 
Target
Name:
Beta-lactamase
Synonyms:
Beta lactamase
Type:
Enzyme Catalytic Domain
Mol. Mass.:
31513.38
Organism:
Pseudomonas aeruginosa
Description:
gi_114881106
Residue:
286
  
Inhibitor
Name:
BDBM93536
Synonyms:
(6aR,11aS)-9-chloro-6-cyclohexyl-3-methoxy-5-oxo-6a,11-dihydroindeno[1,2-c]isoquinoline-11a-carboxylic acid ethyl ester MLS003591333 cid_53301257 ethyl (6aR,11aS)-9-chloro-6-cyclohexyl-3-methoxy-5-oxo-6a,11-dihydroindeno[1,2-c]isoquinoline-11a-carboxylate
Type:
Small organic molecule
Emp. Form.:
C26H28ClNO4
Mol. Mass.:
453.958
SMILES:
CCOC(=O)[C@]12Cc3cc(Cl)ccc3[C@H]1N(C1CCCCC1)C(=O)c1cc(OC)ccc21
: