Target
Receptor-interacting serine/threonine-protein kinase 2
Ligand
BDBM43524
Substrate
IC50
2792±n/a nM
Citation
 PubChem, PC Fluorescence-based cell-based high throughput dose response assay for inhibitors of the interaction of nucleotide-binding oligomerization domain containing 2 (NOD2) and the receptor-interacting serine-threonine kinase 2 (RIPK2) PubChem Bioassay (2012)[AID] 
Target
Name:
Receptor-interacting serine/threonine-protein kinase 2
Synonyms:
CARDIAK RIP2 RIPK2_HUMAN Tyrosine-protein kinase RIPK2 | receptor-interacting serine/threonine-protein kinase 2
Type:
Protein
Mol. Mass.:
61201.30
Organism:
Homo sapiens (Human)
Description:
Residue:
540
  
Inhibitor
Name:
BDBM43524
Synonyms:
4-(4-fluorophenyl)-2-(methylsulfonyl)-6-(trifluoromethyl)pyrimidine 4-(4-fluorophenyl)-2-methylsulfonyl-6-(trifluoromethyl)pyrimidine SMR000297077 cid_2987363
Type:
Small organic molecule
Emp. Form.:
C12H8F4N2O2S
Mol. Mass.:
320.263
SMILES:
CS(=O)(=O)c1nc(cc(n1)C(F)(F)F)-c1ccc(F)cc1
: