Target
Protein Wnt-3a
Ligand
BDBM89460
Substrate
IC50
>50000±n/a nM
Citation
 PubChem, PC Dose response validation of uHTS Gli-SUFU antagonist hits in a Wnt3a luminescent reporter assay PubChem Bioassay (2012)[AID] 
Target
Name:
Protein Wnt-3a
Synonyms:
WNT3A_MOUSE Wnt3a | protein Wnt-3a precursor
Type:
PROTEIN
Mol. Mass.:
39269.29
Organism:
Mus musculus
Description:
ChEMBL_813156
Residue:
352
  
Inhibitor
Name:
BDBM89460
Synonyms:
4-[(9-cyclohexyl-5-methyl-6-oxidanylidene-7,8-dihydropyrimido[4,5-b][1,4]diazepin-2-yl)amino]-3-methoxy-N-(1-methylpiperidin-4-yl)benzamide 4-[(9-cyclohexyl-5-methyl-6-oxo-7,8-dihydropyrimido[4,5-b][1,4]diazepin-2-yl)amino]-3-methoxy-N-(1-methylpiperidin-4-yl)benzamide MLS002232304 cid_25015463
Type:
Small organic molecule
Emp. Form.:
C28H39N7O3
Mol. Mass.:
521.6544
SMILES:
COc1cc(ccc1Nc1ncc2N(C)C(=O)CCN(C3CCCCC3)c2n1)C(=O)NC1CCN(C)CC1
: