Target
Neuropilin-1
Ligand
BDBM80150
Substrate
IC50
>95000±n/a nM
Citation
 PubChem, PC Dose Response confirmation of small molecule modulators of the interaction between CendR and NRP-1 in a panel assay PubChem Bioassay (2012)[AID] 
Target
Name:
Neuropilin-1
Synonyms:
Chain A, Crystal Structure Of The B1b2 Domains From Human Neuropilin- 1 NRP1 Neuropilin-1 | VEGF165R
Type:
PROTEIN
Mol. Mass.:
103122.09
Organism:
Homo sapiens (Human)
Description:
ChEMBL_617636
Residue:
923
  
Inhibitor
Name:
BDBM80150
Synonyms:
4-methyl-N'-(4-methylphenyl)benzenesulfonohydrazide 4-methyl-N'-(p-tolyl)benzenesulfonohydrazide SMR000184512 | cid_786403
Type:
Small organic molecule
Emp. Form.:
C14H16N2O2S
Mol. Mass.:
276.354
SMILES:
Cc1ccc(NNS(=O)(=O)c2ccc(C)cc2)cc1
: