Target
Neuropilin-1
Ligand
BDBM94078
Substrate
IC50
>95000±n/a nM
Citation
 PubChem, PC Dose Response confirmation of small molecule modulators of the interaction between CendR and NRP-1 in a panel assay PubChem Bioassay (2012)[AID] 
Target
Name:
Neuropilin-1
Synonyms:
Chain A, Crystal Structure Of The B1b2 Domains From Human Neuropilin- 1 NRP1 Neuropilin-1 | VEGF165R
Type:
PROTEIN
Mol. Mass.:
103122.09
Organism:
Homo sapiens (Human)
Description:
ChEMBL_617636
Residue:
923
  
Inhibitor
Name:
BDBM94078
Synonyms:
MLS000519357 [3-cyclopropyl-5-hydroxy-5-(trifluoromethyl)-2-pyrazolin-1-yl]-(2-methyl-3-furyl)methanone [3-cyclopropyl-5-hydroxy-5-(trifluoromethyl)-4H-pyrazol-1-yl]-(2-methylfuran-3-yl)methanone cid_4654699
Type:
Small organic molecule
Emp. Form.:
C13H13F3N2O3
Mol. Mass.:
302.2491
SMILES:
Cc1occc1C(=O)N1N=C(CC1(O)C(F)(F)F)C1CC1
: