Target
Neuropilin-1
Ligand
BDBM94081
Substrate
IC50
>95000±n/a nM
Citation
 PubChem, PC Dose Response confirmation of small molecule modulators of the interaction between CendR and NRP-1 in a panel assay PubChem Bioassay (2012)[AID] 
Target
Name:
Neuropilin-1
Synonyms:
Chain A, Crystal Structure Of The B1b2 Domains From Human Neuropilin- 1 NRP1 Neuropilin-1 | VEGF165R
Type:
PROTEIN
Mol. Mass.:
103122.09
Organism:
Homo sapiens (Human)
Description:
ChEMBL_617636
Residue:
923
  
Inhibitor
Name:
BDBM94081
Synonyms:
5-methyl-2-pyrazinecarboxylic acid [2-[(3-cyano-5,6-dihydro-4H-cyclopenta[b]thiophen-2-yl)amino]-2-oxoethyl] ester MLS001141494 [2-[(3-cyano-5,6-dihydro-4H-cyclopenta[b]thiophen-2-yl)amino]-2-oxidanylidene-ethyl] 5-methylpyrazine-2-carboxylate cid_7949997
Type:
Small organic molecule
Emp. Form.:
C16H14N4O3S
Mol. Mass.:
342.372
SMILES:
Cc1cnc(cn1)C(=O)OCC(=O)Nc1sc2CCCc2c1C#N
: