Target
Neuropilin-1
Ligand
BDBM94082
Substrate
IC50
>95000±n/a nM
Citation
 PubChem, PC Dose Response confirmation of small molecule modulators of the interaction between CendR and NRP-1 in a panel assay PubChem Bioassay (2012)[AID] 
Target
Name:
Neuropilin-1
Synonyms:
Chain A, Crystal Structure Of The B1b2 Domains From Human Neuropilin- 1 NRP1 Neuropilin-1 | VEGF165R
Type:
PROTEIN
Mol. Mass.:
103122.09
Organism:
Homo sapiens (Human)
Description:
ChEMBL_617636
Residue:
923
  
Inhibitor
Name:
BDBM94082
Synonyms:
MLS002280319 N-[[4-[[[[5-[(4-methyl-1-piperidinyl)-oxomethyl]-1H-imidazol-4-yl]-oxomethyl]amino]methyl]phenyl]methyl]carbamic acid tert-butyl ester cid_44142001 tert-butyl N-[[4-[[[5-(4-methylpiperidine-1-carbonyl)-1H-imidazole-4-carbonyl]amino]methyl]phenyl]methyl]carbamate
Type:
Small organic molecule
Emp. Form.:
C24H33N5O4
Mol. Mass.:
455.5499
SMILES:
CC1CCN(CC1)C(=O)c1nc[nH]c1C(=O)NCc1ccc(CNC(=O)OC(C)(C)C)cc1
: