Target
Neuropilin-1
Ligand
BDBM94084
Substrate
IC50
>95000±n/a nM
Citation
 PubChem, PC Dose Response confirmation of small molecule modulators of the interaction between CendR and NRP-1 in a panel assay PubChem Bioassay (2012)[AID] 
Target
Name:
Neuropilin-1
Synonyms:
Chain A, Crystal Structure Of The B1b2 Domains From Human Neuropilin- 1 NRP1 Neuropilin-1 | VEGF165R
Type:
PROTEIN
Mol. Mass.:
103122.09
Organism:
Homo sapiens (Human)
Description:
ChEMBL_617636
Residue:
923
  
Inhibitor
Name:
BDBM94084
Synonyms:
1-[3-[4-(2-methoxyphenyl)-1-piperazinyl]-1-piperidinyl]-2-(1-pyrazolyl)ethanone 1-[3-[4-(2-methoxyphenyl)piperazin-1-yl]piperidin-1-yl]-2-pyrazol-1-ylethanone MLS001105171 cid_24817464
Type:
Small organic molecule
Emp. Form.:
C21H29N5O2
Mol. Mass.:
383.4873
SMILES:
COc1ccccc1N1CCN(CC1)C1CCCN(C1)C(=O)Cn1cccn1
: