Target
Neuropilin-1
Ligand
BDBM94086
Substrate
IC50
>95000±n/a nM
Citation
 PubChem, PC Dose Response confirmation of small molecule modulators of the interaction between CendR and NRP-1 in a panel assay PubChem Bioassay (2012)[AID] 
Target
Name:
Neuropilin-1
Synonyms:
Chain A, Crystal Structure Of The B1b2 Domains From Human Neuropilin- 1 NRP1 Neuropilin-1 | VEGF165R
Type:
PROTEIN
Mol. Mass.:
103122.09
Organism:
Homo sapiens (Human)
Description:
ChEMBL_617636
Residue:
923
  
Inhibitor
Name:
BDBM94086
Synonyms:
2-[(5,7-dimethyl-[1,2,4]triazolo[4,3-a]pyrimidin-3-yl)sulfanyl]-N-(3-sulfamoylphenyl)acetamide 2-[(5,7-dimethyl-[1,2,4]triazolo[4,3-a]pyrimidin-3-yl)thio]-N-(3-sulfamoylphenyl)acetamide SMR001308809 | cid_4291884
Type:
Small organic molecule
Emp. Form.:
C15H16N6O3S2
Mol. Mass.:
392.456
SMILES:
Cc1cc(C)n2c(SCC(=O)Nc3cccc(c3)S(N)(=O)=O)nnc2n1
: