Target
Neuropilin-1
Ligand
BDBM94089
Substrate
IC50
>95000±n/a nM
Citation
 PubChem, PC Dose Response confirmation of small molecule modulators of the interaction between CendR and NRP-1 in a panel assay PubChem Bioassay (2012)[AID] 
Target
Name:
Neuropilin-1
Synonyms:
Chain A, Crystal Structure Of The B1b2 Domains From Human Neuropilin- 1 NRP1 Neuropilin-1 | VEGF165R
Type:
PROTEIN
Mol. Mass.:
103122.09
Organism:
Homo sapiens (Human)
Description:
ChEMBL_617636
Residue:
923
  
Inhibitor
Name:
BDBM94089
Synonyms:
4-(2-ethoxyphenyl)-7,7-dimethyl-3,4,6,8-tetrahydro-1H-quinoline-2,5-dione 7,7-dimethyl-4-o-phenetyl-3,4,6,8-tetrahydro-1H-quinoline-2,5-quinone SMR000025522 | cid_2997005
Type:
Small organic molecule
Emp. Form.:
C19H23NO3
Mol. Mass.:
313.3908
SMILES:
CCOc1ccccc1C1CC(=O)NC2=C1C(=O)CC(C)(C)C2
: