Target
Neuropilin-1
Ligand
BDBM94090
Substrate
IC50
>95000±n/a nM
Citation
 PubChem, PC Dose Response confirmation of small molecule modulators of the interaction between CendR and NRP-1 in a panel assay PubChem Bioassay (2012)[AID] 
Target
Name:
Neuropilin-1
Synonyms:
Chain A, Crystal Structure Of The B1b2 Domains From Human Neuropilin- 1 NRP1 Neuropilin-1 | VEGF165R
Type:
PROTEIN
Mol. Mass.:
103122.09
Organism:
Homo sapiens (Human)
Description:
ChEMBL_617636
Residue:
923
  
Inhibitor
Name:
BDBM94090
Synonyms:
(5S)-1-[2-(3-fluorophenyl)ethyl]-5-methyl-N-phenyl-4,5-dihydroimidazol-2-amine SMR000752786 cid_25102527
Type:
Small organic molecule
Emp. Form.:
C18H20FN3
Mol. Mass.:
297.3699
SMILES:
C[C@H]1CN=C(Nc2ccccc2)N1CCc1cccc(F)c1
: