Target
Neuropilin-1
Ligand
BDBM94091
Substrate
IC50
>95000±n/a nM
Citation
 PubChem, PC Dose Response confirmation of small molecule modulators of the interaction between CendR and NRP-1 in a panel assay PubChem Bioassay (2012)[AID] 
Target
Name:
Neuropilin-1
Synonyms:
Chain A, Crystal Structure Of The B1b2 Domains From Human Neuropilin- 1 NRP1 Neuropilin-1 | VEGF165R
Type:
PROTEIN
Mol. Mass.:
103122.09
Organism:
Homo sapiens (Human)
Description:
ChEMBL_617636
Residue:
923
  
Inhibitor
Name:
BDBM94091
Synonyms:
1-benzyl-5-keto-N-[2-pyrrolidino-5-(trifluoromethyl)phenyl]pyrrolidine-3-carboxamide 5-oxidanylidene-1-(phenylmethyl)-N-[2-pyrrolidin-1-yl-5-(trifluoromethyl)phenyl]pyrrolidine-3-carboxamide MLS001141743 cid_16561247
Type:
Small organic molecule
Emp. Form.:
C23H24F3N3O2
Mol. Mass.:
431.4508
SMILES:
FC(F)(F)c1ccc(N2CCCC2)c(NC(=O)C2CN(Cc3ccccc3)C(=O)C2)c1
: