Target
Perilipin-1
Ligand
BDBM94506
Substrate
IC50
1895±n/a nM
Citation
 PubChem, PC Counterscreen for inhibitors of the interaction of the lipase co-activator protein, abhydrolase domain containing 5 (ABHD5) with perilipin-5 (MLDP; PLIN5) PubChem Bioassay (2012)[AID] 
Target
Name:
Perilipin-1
Synonyms:
PERI PLIN1 | PLIN1_HUMAN
Type:
Enzyme Catalytic Domain
Mol. Mass.:
55988.69
Organism:
Homo sapiens (Human)
Description:
gi_223718203
Residue:
522
  
Inhibitor
Name:
BDBM94506
Synonyms:
MLS003674209 N-cyclohexyl-2-(2-fluorophenyl)-2-[3-(2-furyl)-2-keto-quinoxalin-1-yl]acetamide N-cyclohexyl-2-(2-fluorophenyl)-2-[3-(furan-2-yl)-2-oxoquinoxalin-1-yl]acetamide cid_53383334
Type:
Small organic molecule
Emp. Form.:
C26H24FN3O3
Mol. Mass.:
445.4855
SMILES:
Fc1ccccc1C(C(=O)NC1CCCCC1)n1c2ccccc2nc(-c2ccco2)c1=O
: