Target
Perilipin-1
Ligand
BDBM94561
Substrate
IC50
1092±n/a nM
Citation
 PubChem, PC Counterscreen for inhibitors of the interaction of the lipase co-activator protein, abhydrolase domain containing 5 (ABHD5) with perilipin-5 (MLDP; PLIN5) PubChem Bioassay (2012)[AID] 
Target
Name:
Perilipin-1
Synonyms:
PERI PLIN1 | PLIN1_HUMAN
Type:
Enzyme Catalytic Domain
Mol. Mass.:
55988.69
Organism:
Homo sapiens (Human)
Description:
gi_223718203
Residue:
522
  
Inhibitor
Name:
BDBM94561
Synonyms:
2-(2-fluorophenyl)-2-[3-(2-furanyl)-2-oxo-1-quinoxalinyl]-N-pentylacetamide 2-(2-fluorophenyl)-2-[3-(furan-2-yl)-2-oxoquinoxalin-1-yl]-N-pentylacetamide N-amyl-2-(2-fluorophenyl)-2-[3-(2-furyl)-2-keto-quinoxalin-1-yl]acetamide cid_53383152
Type:
Small organic molecule
Emp. Form.:
C25H24FN3O3
Mol. Mass.:
433.4748
SMILES:
CCCCCNC(=O)C(c1ccccc1F)n1c2ccccc2nc(-c2ccco2)c1=O
: