Target
Perilipin-1
Ligand
BDBM34962
Substrate
IC50
1809±n/a nM
Citation
 PubChem, PC Counterscreen for inhibitors of the interaction of the lipase co-activator protein, abhydrolase domain containing 5 (ABHD5) with perilipin-5 (MLDP; PLIN5) PubChem Bioassay (2012)[AID] 
Target
Name:
Perilipin-1
Synonyms:
PERI PLIN1 | PLIN1_HUMAN
Type:
Enzyme Catalytic Domain
Mol. Mass.:
55988.69
Organism:
Homo sapiens (Human)
Description:
gi_223718203
Residue:
522
  
Inhibitor
Name:
BDBM34962
Synonyms:
5-hydroxy-4-[[4-(2-hydroxyethyl)-1-piperazinyl]methyl]-2-methyl-3-benzo[g]benzofurancarboxylic acid ethyl ester MLS000775788 cid_1523396 ethyl 5-hydroxy-4-[[4-(2-hydroxyethyl)piperazin-1-yl]methyl]-2-methylbenzo[g][1]benzofuran-3-carboxylate
Type:
Small organic molecule
Emp. Form.:
C23H28N2O5
Mol. Mass.:
412.4788
SMILES:
CCOC(=O)c1c(C)oc2c1c(CN1CCN(CCO)CC1)c(O)c1ccccc21
: