Target
Protein O-GlcNAcase
Ligand
BDBM70885
Substrate
Meas. Tech.
Cell-based ELISA
Temperature
277.15±n/a K
EC50
139±n/a nM
Comments
extracted
Citation
 Kaul, RMcEachern, EJVocadlo, DJZhou, YDang, QSelnick, HG Glycosidase inhibitors and uses thereof US Patent  US9695197 Publication Date 7/4/2017 
Target
Name:
Protein O-GlcNAcase
Synonyms:
2-acetamido-2-deoxy-β-D-glucopyranosidase (O-GlcNAcase) Beta-hexosaminidase (O-GlcNAcase) HEXC MEA5 N-acetyl-beta-D-glucosaminidase (O-GlcNAcase) OGA Protein O-GlcNAcase
Type:
Enzyme
Mol. Mass.:
102874.67
Organism:
Homo sapiens (Human)
Description:
O60502
Residue:
916
  
Inhibitor
Name:
BDBM70885
Synonyms:
US9695197, 2
Type:
Small organic molecule
Emp. Form.:
C9H16N2O3S2
Mol. Mass.:
264.365
SMILES:
CCNC1=N[C@H]2[C@@H](S1)S[C@H](CO)[C@@H](O)[C@@H]2O
: