Target
Low molecular weight phosphotyrosine protein phosphatase
Ligand
BDBM94904
Substrate
IC50
11600±n/a nM
Citation
 PubChem, PC Dose response confirmation of small molecule inhibitors of Low Molecular Weight Protein Tyrosine Phosphatase, LMPTP, via a fluorescence intensity assay PubChem Bioassay (2012)[AID] 
Target
Name:
Low molecular weight phosphotyrosine protein phosphatase
Synonyms:
3.1.3.2 ACP1 LMW-PTP LMWPTP PPAC_HUMAN low molecular weight phosphotyrosine protein phosphatase isoform c
Type:
Mol. Mass.:
18042.81
Organism:
Homo sapiens (Human)
Description:
P24666
Residue:
158
  
Inhibitor
Name:
BDBM94904
Synonyms:
Benzo[1,3]dioxole-5-carboxylic acid [3-(4-bromo-phenyl)-allylidene]-hydrazide N-[(Z)-[(E)-3-(4-bromophenyl)prop-2-enylidene]amino]-1,3-benzodioxole-5-carboxamide SMR000608100 | cid_5799507
Type:
Small organic molecule
Emp. Form.:
C17H13BrN2O3
Mol. Mass.:
373.201
SMILES:
Brc1ccc(\C=C\C=N/NC(=O)c2ccc3OCOc3c2)cc1
: