Target
Low molecular weight phosphotyrosine protein phosphatase
Ligand
BDBM94957
Substrate
IC50
3200±n/a nM
Citation
 PubChem, PC Dose response confirmation of small molecule inhibitors of Low Molecular Weight Protein Tyrosine Phosphatase, LMPTP, via a fluorescence intensity assay PubChem Bioassay (2012)[AID] 
Target
Name:
Low molecular weight phosphotyrosine protein phosphatase
Synonyms:
3.1.3.2 ACP1 LMW-PTP LMWPTP PPAC_HUMAN low molecular weight phosphotyrosine protein phosphatase isoform c
Type:
Mol. Mass.:
18042.81
Organism:
Homo sapiens (Human)
Description:
P24666
Residue:
158
  
Inhibitor
Name:
BDBM94957
Synonyms:
(5Z)-1-[2-(4-fluorophenyl)ethyl]-5-[(piperonylamino)methylene]barbituric acid 5-[1-[(Benzo[1,3]dioxol-5-ylmethyl)-amino]-meth-(Z)-ylidene]-1-[2-(4-fluoro-phenyl)-ethyl]-pyrimidine-2,4, 6-trione SMR000148423 | cid_5516744
Type:
Small organic molecule
Emp. Form.:
C21H18FN3O5
Mol. Mass.:
411.3831
SMILES:
Fc1ccc(CCN2C(=O)NC(=O)C(=CNCc3ccc4OCOc4c3)C2=O)cc1
: