Target
Mitochondrial peptide methionine sulfoxide reductase
Ligand
BDBM95457
Substrate
IC50
48026±n/a nM
Citation
 PubChem, PC Absorbance-based biochemical high throughput dose response assay to identify inhibitors of Methionine sulfoxide reductase A (MsrA) PubChem Bioassay (2013)[AID] 
Target
Name:
Mitochondrial peptide methionine sulfoxide reductase
Synonyms:
MSRA MSRA_BOVIN
Type:
Enzyme Catalytic Domain
Mol. Mass.:
25822.90
Organism:
Bos taurus
Description:
gi_73586699
Residue:
233
  
Inhibitor
Name:
BDBM95457
Synonyms:
3-methyl-5-nitro-4-imidazolesulfonic acid phenyl ester MLS002608074 cid_81400 phenyl 3-methyl-5-nitroimidazole-4-sulfonate
Type:
Small organic molecule
Emp. Form.:
C10H9N3O5S
Mol. Mass.:
283.261
SMILES:
Cn1cnc(c1S(=O)(=O)Oc1ccccc1)[N+]([O-])=O
: