Target
Tyrosine-protein phosphatase non-receptor type 22
Ligand
BDBM94883
Substrate
IC50
>80000±n/a nM
Citation
 PubChem, PC Dose response confirmation of small molecule inhibitors of Low Molecular Weight Protein Tyrosine Phosphatase, LMPTP, in a fluorescence-based, Lymphoid Phosphatase (PTPN22, LYP-1) selectivity Assay PubChem Bioassay (2013)[AID] 
Target
Name:
Tyrosine-protein phosphatase non-receptor type 22
Synonyms:
3.1.3.48 LyP Lymphoid phosphatase (Lyp) PEST-domain phosphatase PTPN22 Tyrosine-protein phosphatase non-receptor type 22 (LYP) | tyrosine-protein phosphatase non-receptor type 22 isoform 1
Type:
Mol. Mass.:
91712.31
Organism:
Homo sapiens (Human)
Description:
Q9Y2R2
Residue:
807
  
Inhibitor
Name:
BDBM94883
Synonyms:
MLS000581430 N-[4-[[4-(2,4-dichlorophenoxy)butanoylamino]carbamoyl]phenyl]benzamide N-[4-[[[4-(2,4-dichlorophenoxy)-1-oxobutyl]hydrazo]-oxomethyl]phenyl]benzamide cid_2211342
Type:
Small organic molecule
Emp. Form.:
C24H21Cl2N3O4
Mol. Mass.:
486.347
SMILES:
Clc1ccc(OCCCC(=O)NNC(=O)c2ccc(NC(=O)c3ccccc3)cc2)c(Cl)c1
: