Target
Albumin
Ligand
BDBM61896
Substrate
IC50
>94105±n/a nM
Citation
 PubChem, PC Counterscreen for inhibitors of T-cell receptor (TCR)-CD3 interaction: Fluorescence-based biochemical high throughput dose response assay to identify inhibitors of T-cell receptor (TCR)-CD3 interaction using a TAMRA-labeled BSA probe PubChem Bioassay (2013)[AID] 
Target
Name:
Albumin
Synonyms:
ALB Serum albumin | serum albumin precursor
Type:
PROTEIN
Mol. Mass.:
69288.15
Organism:
Bos taurus
Description:
ChEMBL_1502598
Residue:
607
  
Inhibitor
Name:
BDBM61896
Synonyms:
2-(3,4-dihydroxyphenyl)-4-benzo[h][1]benzopyranone 2-[3,4-bis(oxidanyl)phenyl]benzo[h]chromen-4-one MLS001360569 cid_676291
Type:
Small organic molecule
Emp. Form.:
C19H12O4
Mol. Mass.:
304.2962
SMILES:
Oc1ccc(cc1O)-c1cc(=O)c2ccc3ccccc3c2o1
: