Target
Cyclic AMP receptor protein
Ligand
BDBM96550
Substrate
IC50
77940±n/a nM
Citation
 PubChem, PC Vibrio cholerae assay for pro-quorum sensing small molecules PubChem Bioassay (2013)[AID] 
Target
Name:
Cyclic AMP receptor protein
Synonyms:
Type:
Enzyme Catalytic Domain
Mol. Mass.:
23640.23
Organism:
Vibrio cholerae O1 biovar El Tor str. N16961
Description:
Q9KNW6
Residue:
210
  
Inhibitor
Name:
BDBM96550
Synonyms:
MLS000325579 N-(2,4-difluorophenyl)-3-[[3-(trifluoromethyl)phenyl]methylsulfanyl]thiophene-2-carboxamide N-(2,4-difluorophenyl)-3-{[3-(trifluoromethyl)benzyl]sulfanyl}-2-thiophenecarboxamide SMR000169985 | cid_2765040
Type:
Small organic molecule
Emp. Form.:
C19H12F5NOS2
Mol. Mass.:
429.427
SMILES:
Fc1ccc(NC(=O)c2sccc2SCc2cccc(c2)C(F)(F)F)c(F)c1
: