Target
Trace amine-associated receptor 1
Ligand
BDBM65923
Substrate
IC50
5050±n/a nM
Citation
 PubChem, PC Counterscreen for agonists of the human trace amine associated receptor 1 (hTAAR1): Fluorescence-based cell-based high throughput dose response assay to identify hTAAR1 agonist that also desensitize TAAR1 receptor response. PubChem Bioassay (2013)[AID] 
Target
Name:
Trace amine-associated receptor 1
Synonyms:
TA1 TAAR1_HUMAN TRAR1 | trace amine-associated receptor 1
Type:
PROTEIN
Mol. Mass.:
39107.47
Organism:
Homo sapiens (Human)
Description:
ChEMBL_792734
Residue:
339
  
Inhibitor
Name:
BDBM65923
Synonyms:
1-(3-Fluoro-phenyl)-3-pyridin-3-yl-urea 1-(3-fluorophenyl)-3-(3-pyridyl)urea 1-(3-fluorophenyl)-3-pyridin-3-ylurea SMR000517146 | cid_853873
Type:
Small organic molecule
Emp. Form.:
C12H10FN3O
Mol. Mass.:
231.2257
SMILES:
Fc1cccc(NC(=O)Nc2cccnc2)c1
: