Target
Tachykinin-3
Ligand
BDBM97472
Substrate
Meas. Tech.
Human NK3 Receptor Binding Assay
pH
7.4±n/a
IC50
24±0.0 nM
Comments
extracted
Citation
 Ikeura, YShirai, JSugiyama, HNishikimi, YKamei, TSakauchi, N Nitrogen-containing heterocyclic compound and use thereof US Patent  US8470816 Publication Date 6/25/2013 
Target
Name:
Tachykinin-3
Synonyms:
NKNB TKNK_HUMAN | Tachykinin receptor 3 (NK3)
Type:
Protein
Mol. Mass.:
13439.23
Organism:
Homo sapiens (Human)
Description:
Q9UHF0
Residue:
121
  
Inhibitor
Name:
BDBM97472
Synonyms:
US8470816, 18
Type:
Small molecule
Emp. Form.:
C27H30BrCl2N3O3
Mol. Mass.:
595.355
SMILES:
CN([C@@H]1CCN(CC1c1ccc(Cl)c(Cl)c1)C(=O)C1CCN(CC1)C(C)=O)C(=O)c1ccc(Br)cc1
: