Target
Probable nicotinate-nucleotide adenylyltransferase
Ligand
BDBM98094
Substrate
Meas. Tech.
NaMNAT HPLC Enzyme Assay
pH
7.5±0
Temperature
273.15±0 K
IC50
>150000±0.0 nM
Citation
 Moro, WBYang, ZKane, TAZhou, QHarville, SBrouillette, CGBrouillette, WJ SAR studies for a new class of antibacterial NAD biosynthesis inhibitors. J Comb Chem 11:617-25 (2009)  
Target
Name:
Probable nicotinate-nucleotide adenylyltransferase
Synonyms:
BAMEG_4595 Deamido-NAD(+) pyrophosphorylase Nicotinate mononucleotide adenylyltransferase Nicotinate-nucleotide adenylyltransferase (NadD) nadD
Type:
Enzyme
Mol. Mass.:
21955.08
Organism:
Bacillus anthracis
Description:
C3L5T6
Residue:
189
  
Inhibitor
Name:
BDBM98094
Synonyms:
1-(2-nitrophenyl)-3-[4-(o-tolylsulfonylamino)phenyl]urea | Compound ID 7{3,1}
Type:
Small organic molecule
Emp. Form.:
C20H18N4O5S
Mol. Mass.:
426.446
SMILES:
Cc1ccccc1S(=O)(=O)Nc1ccc(NC(=O)Nc2ccccc2[N+]([O-])=O)cc1
: