Target
Probable nicotinate-nucleotide adenylyltransferase
Ligand
BDBM98096
Substrate
Meas. Tech.
NaMNAT HPLC Enzyme Assay
pH
7.5±0
Temperature
273.15±0 K
IC50
>150000±0.0 nM
Citation
 Moro, WBYang, ZKane, TAZhou, QHarville, SBrouillette, CGBrouillette, WJ SAR studies for a new class of antibacterial NAD biosynthesis inhibitors. J Comb Chem 11:617-25 (2009)  
Target
Name:
Probable nicotinate-nucleotide adenylyltransferase
Synonyms:
BAMEG_4595 Deamido-NAD(+) pyrophosphorylase Nicotinate mononucleotide adenylyltransferase Nicotinate-nucleotide adenylyltransferase (NadD) nadD
Type:
Enzyme
Mol. Mass.:
21955.08
Organism:
Bacillus anthracis
Description:
C3L5T6
Residue:
189
  
Inhibitor
Name:
BDBM98096
Synonyms:
1-[4-(m-tolylsulfonylamino)phenyl]-3-(3-nitrophenyl)urea | Compound ID 7{2,2}
Type:
Small organic molecule
Emp. Form.:
C20H18N4O5S
Mol. Mass.:
426.446
SMILES:
Cc1cccc(c1)S(=O)(=O)Nc1ccc(NC(=O)Nc2cccc(c2)[N+]([O-])=O)cc1
: