Target
Probable nicotinate-nucleotide adenylyltransferase
Ligand
BDBM98129
Substrate
Meas. Tech.
NaMNAT HPLC Enzyme Assay
pH
7.5±0
Temperature
273.15±0 K
IC50
150000±0.0 nM
Citation
 Moro, WBYang, ZKane, TAZhou, QHarville, SBrouillette, CGBrouillette, WJ SAR studies for a new class of antibacterial NAD biosynthesis inhibitors. J Comb Chem 11:617-25 (2009)  
Target
Name:
Probable nicotinate-nucleotide adenylyltransferase
Synonyms:
BAMEG_4595 Deamido-NAD(+) pyrophosphorylase Nicotinate mononucleotide adenylyltransferase Nicotinate-nucleotide adenylyltransferase (NadD) nadD
Type:
Enzyme
Mol. Mass.:
21955.08
Organism:
Bacillus anthracis
Description:
C3L5T6
Residue:
189
  
Inhibitor
Name:
BDBM98129
Synonyms:
1-(3-nitrophenyl)-3-[4-[[4-(trifluoromethyl)phenyl]sulfonylamino]phenyl]urea | Compound ID 7{2,13}
Type:
Small organic molecule
Emp. Form.:
C20H15F3N4O5S
Mol. Mass.:
480.417
SMILES:
[O-][N+](=O)c1cccc(NC(=O)Nc2ccc(NS(=O)(=O)c3ccc(cc3)C(F)(F)F)cc2)c1
: