Target
Glutaminyl-peptide cyclotransferase
Ligand
BDBM98181
Substrate
Meas. Tech.
Spectrophotometic Assay
Ki
7.25e+3±n/a nM
IC50
3.02e+4±n/a nM
Citation
 Heiser, URamsbeck, DSommer, RMeyer, AHoffmann, TBoehme, LDemuth, H Inhibitors US Patent  US8486940 Publication Date 7/16/2013 
Target
Name:
Glutaminyl-peptide cyclotransferase
Synonyms:
Glutaminyl Cyclase Glutaminyl-peptide cyclotransferase Glutaminyl-tRNA cyclotransferase QPCT | QPCT_HUMAN
Type:
Enzyme
Mol. Mass.:
40877.05
Organism:
Homo sapiens (Human)
Description:
Q16769
Residue:
361
  
Inhibitor
Name:
BDBM98181
Synonyms:
US8486940, 13
Type:
Small organic molecule
Emp. Form.:
C19H20N4O2
Mol. Mass.:
336.3877
SMILES:
CCCOc1ccc(cc1)[C@@H]1CNC(=O)N1c1ccc2nc[nH]c2c1
: