Target
Glutaminyl-peptide cyclotransferase
Ligand
BDBM98184
Substrate
Meas. Tech.
Spectrophotometic Assay
Ki
75±n/a nM
IC50
397±n/a nM
Citation
 Heiser, URamsbeck, DSommer, RMeyer, AHoffmann, TBoehme, LDemuth, H Inhibitors US Patent  US8486940 Publication Date 7/16/2013 
Target
Name:
Glutaminyl-peptide cyclotransferase
Synonyms:
Glutaminyl Cyclase Glutaminyl-peptide cyclotransferase Glutaminyl-tRNA cyclotransferase QPCT | QPCT_HUMAN
Type:
Enzyme
Mol. Mass.:
40877.05
Organism:
Homo sapiens (Human)
Description:
Q16769
Residue:
361
  
Inhibitor
Name:
BDBM98184
Synonyms:
US8486940, 55
Type:
Small organic molecule
Emp. Form.:
C19H20N4O2
Mol. Mass.:
336.3877
SMILES:
CCCOc1ccc(cc1)C1CNC(=O)N1c1ccn2ccnc2c1
: