Target
Glutaminyl-peptide cyclotransferase
Ligand
BDBM98185
Substrate
Meas. Tech.
Spectrophotometic Assay
Ki
149±n/a nM
IC50
882±n/a nM
Citation
 Heiser, URamsbeck, DSommer, RMeyer, AHoffmann, TBoehme, LDemuth, H Inhibitors US Patent  US8486940 Publication Date 7/16/2013 
Target
Name:
Glutaminyl-peptide cyclotransferase
Synonyms:
Glutaminyl Cyclase Glutaminyl-peptide cyclotransferase Glutaminyl-tRNA cyclotransferase QPCT | QPCT_HUMAN
Type:
Enzyme
Mol. Mass.:
40877.05
Organism:
Homo sapiens (Human)
Description:
Q16769
Residue:
361
  
Inhibitor
Name:
BDBM98185
Synonyms:
US8486940, 60 | US9650362, 60
Type:
Small organic molecule
Emp. Form.:
C22H18N4O
Mol. Mass.:
354.4045
SMILES:
O=C1NCC(N1c1ccn2ccnc2c1)c1ccc(cc1)-c1ccccc1
: