Target
Glutaminyl-peptide cyclotransferase
Ligand
BDBM98186
Substrate
Meas. Tech.
Spectrophotometic Assay
Ki
33.6±n/a nM
IC50
170±n/a nM
Citation
 Heiser, URamsbeck, DSommer, RMeyer, AHoffmann, TBoehme, LDemuth, H Inhibitors US Patent  US8486940 Publication Date 7/16/2013 
Target
Name:
Glutaminyl-peptide cyclotransferase
Synonyms:
Glutaminyl Cyclase Glutaminyl-peptide cyclotransferase Glutaminyl-tRNA cyclotransferase QPCT | QPCT_HUMAN
Type:
Enzyme
Mol. Mass.:
40877.05
Organism:
Homo sapiens (Human)
Description:
Q16769
Residue:
361
  
Inhibitor
Name:
BDBM98186
Synonyms:
US8486940, 73 | US9650362, 73
Type:
Small organic molecule
Emp. Form.:
C19H19N3O3
Mol. Mass.:
337.3725
SMILES:
CCCOc1ccc(cc1)[C@H]1COC(=O)N1c1ccc2nc[nH]c2c1
: