Target
Glutaminyl-peptide cyclotransferase
Ligand
BDBM98187
Substrate
Meas. Tech.
Spectrophotometic Assay
Ki
12.5±n/a nM
IC50
160±n/a nM
Citation
 Heiser, URamsbeck, DSommer, RMeyer, AHoffmann, TBoehme, LDemuth, H Inhibitors US Patent  US8486940 Publication Date 7/16/2013 
Target
Name:
Glutaminyl-peptide cyclotransferase
Synonyms:
Glutaminyl Cyclase Glutaminyl-peptide cyclotransferase Glutaminyl-tRNA cyclotransferase QPCT | QPCT_HUMAN
Type:
Enzyme
Mol. Mass.:
40877.05
Organism:
Homo sapiens (Human)
Description:
Q16769
Residue:
361
  
Inhibitor
Name:
BDBM98187
Synonyms:
US8486940, 89 | US9650362, 89
Type:
Small organic molecule
Emp. Form.:
C26H25N5O2
Mol. Mass.:
439.509
SMILES:
O=C1OC[C@@H](N1c1ccc2nc[nH]c2c1)c1ccc(cc1)N1CCN(CC1)c1ccccc1
: