Target
Glutaminyl-peptide cyclotransferase
Ligand
BDBM98189
Substrate
Meas. Tech.
Spectrophotometic Assay
Ki
58.8±n/a nM
IC50
240±n/a nM
Citation
 Heiser, URamsbeck, DSommer, RMeyer, AHoffmann, TBoehme, LDemuth, H Inhibitors US Patent  US8486940 Publication Date 7/16/2013 
Target
Name:
Glutaminyl-peptide cyclotransferase
Synonyms:
Glutaminyl Cyclase Glutaminyl-peptide cyclotransferase Glutaminyl-tRNA cyclotransferase QPCT | QPCT_HUMAN
Type:
Enzyme
Mol. Mass.:
40877.05
Organism:
Homo sapiens (Human)
Description:
Q16769
Residue:
361
  
Inhibitor
Name:
BDBM98189
Synonyms:
US8486940, 145
Type:
Small organic molecule
Emp. Form.:
C24H21N3O2
Mol. Mass.:
383.4424
SMILES:
CCCOc1ccc(cc1)[C@@H]1N(C(=O)c2ccccc12)c1ccc2nc[nH]c2c1
: