Target
Glutaminyl-peptide cyclotransferase
Ligand
BDBM64607
Substrate
Meas. Tech.
Spectrophotometic Assay
IC50
<10000±n/a nM
Citation
 Heiser, URamsbeck, DSommer, RMeyer, AHoffmann, TBoehme, LDemuth, H Inhibitors US Patent  US8486940 Publication Date 7/16/2013 
Target
Name:
Glutaminyl-peptide cyclotransferase
Synonyms:
Glutaminyl Cyclase Glutaminyl-peptide cyclotransferase Glutaminyl-tRNA cyclotransferase QPCT | QPCT_HUMAN
Type:
Enzyme
Mol. Mass.:
40877.05
Organism:
Homo sapiens (Human)
Description:
Q16769
Residue:
361
  
Inhibitor
Name:
BDBM64607
Synonyms:
US8486940, 16
Type:
Emp. Form.:
C21H24N4O2
Mol. Mass.:
364.4409
SMILES:
CCCCCOc1ccc(cc1)C1CNC(=O)N1c1ccc2nc[nH]c2c1
: