Target
Glutaminyl-peptide cyclotransferase
Ligand
BDBM64615
Substrate
Meas. Tech.
Spectrophotometic Assay
IC50
<10000±n/a nM
Citation
 Heiser, URamsbeck, DSommer, RMeyer, AHoffmann, TBoehme, LDemuth, H Inhibitors US Patent  US8486940 Publication Date 7/16/2013 
Target
Name:
Glutaminyl-peptide cyclotransferase
Synonyms:
Glutaminyl Cyclase Glutaminyl-peptide cyclotransferase Glutaminyl-tRNA cyclotransferase QPCT | QPCT_HUMAN
Type:
Enzyme
Mol. Mass.:
40877.05
Organism:
Homo sapiens (Human)
Description:
Q16769
Residue:
361
  
Inhibitor
Name:
BDBM64615
Synonyms:
US8486940, 23
Type:
Emp. Form.:
C17H14F2N4O2
Mol. Mass.:
344.3155
SMILES:
COc1cc(F)c(C2CNC(=O)N2c2ccc3nc[nH]c3c2)c(F)c1
: