Target
Glutaminyl-peptide cyclotransferase
Ligand
BDBM64620
Substrate
Meas. Tech.
Spectrophotometic Assay
IC50
<10000±n/a nM
Citation
 Heiser, URamsbeck, DSommer, RMeyer, AHoffmann, TBoehme, LDemuth, H Inhibitors US Patent  US8486940 Publication Date 7/16/2013 
Target
Name:
Glutaminyl-peptide cyclotransferase
Synonyms:
Glutaminyl Cyclase Glutaminyl-peptide cyclotransferase Glutaminyl-tRNA cyclotransferase QPCT | QPCT_HUMAN
Type:
Enzyme
Mol. Mass.:
40877.05
Organism:
Homo sapiens (Human)
Description:
Q16769
Residue:
361
  
Inhibitor
Name:
BDBM64620
Synonyms:
US8486940, 25
Type:
Emp. Form.:
C23H27N5O3
Mol. Mass.:
421.4922
SMILES:
O=C1NCC(N1c1ccc2nc[nH]c2c1)c1ccc(OCCCN2CCOCC2)cc1
: