Target
Glutaminyl-peptide cyclotransferase
Ligand
BDBM64621
Substrate
Meas. Tech.
Spectrophotometic Assay
IC50
<10000±n/a nM
Citation
 Heiser, URamsbeck, DSommer, RMeyer, AHoffmann, TBoehme, LDemuth, H Inhibitors US Patent  US8486940 Publication Date 7/16/2013 
Target
Name:
Glutaminyl-peptide cyclotransferase
Synonyms:
Glutaminyl Cyclase Glutaminyl-peptide cyclotransferase Glutaminyl-tRNA cyclotransferase QPCT | QPCT_HUMAN
Type:
Enzyme
Mol. Mass.:
40877.05
Organism:
Homo sapiens (Human)
Description:
Q16769
Residue:
361
  
Inhibitor
Name:
BDBM64621
Synonyms:
US8486940, 26
Type:
Emp. Form.:
C22H25N5O3
Mol. Mass.:
407.4656
SMILES:
O=C1NCC(N1c1ccc2nc[nH]c2c1)c1ccccc1OCCN1CCOCC1
: