Target
Glutaminyl-peptide cyclotransferase
Ligand
BDBM64650
Substrate
Meas. Tech.
Spectrophotometic Assay
IC50
<10000±n/a nM
Citation
 Heiser, URamsbeck, DSommer, RMeyer, AHoffmann, TBoehme, LDemuth, H Inhibitors US Patent  US8486940 Publication Date 7/16/2013 
Target
Name:
Glutaminyl-peptide cyclotransferase
Synonyms:
Glutaminyl Cyclase Glutaminyl-peptide cyclotransferase Glutaminyl-tRNA cyclotransferase QPCT | QPCT_HUMAN
Type:
Enzyme
Mol. Mass.:
40877.05
Organism:
Homo sapiens (Human)
Description:
Q16769
Residue:
361
  
Inhibitor
Name:
BDBM64650
Synonyms:
US8486940, 46
Type:
Emp. Form.:
C22H17ClN4O
Mol. Mass.:
388.85
SMILES:
Clc1cccc(c1)-c1ccc(cc1)C1CNC(=O)N1c1ccc2nc[nH]c2c1
: