Target
Adenosine receptor A2
Ligand
BDBM99192
Substrate
Meas. Tech.
Binding Assay
Ki
476±0.0 nM
Citation
 Jagtap, P Adenosine compounds and their use thereof US Patent  US8501708 Publication Date 8/6/2013 
Target
Name:
Adenosine receptor A2
Synonyms:
Adenosine A2a receptor
Type:
Protein
Mol. Mass.:
44661.95
Organism:
Oryctolagus cuniculus (rabbit)
Description:
XP_002722612 (sequence modified)
Residue:
409
  
Inhibitor
Name:
BDBM99192
Synonyms:
US8501708, 12
Type:
Small organic molecule
Emp. Form.:
C22H27N5O5
Mol. Mass.:
441.4803
SMILES:
OC[C@H]1OC([C@H](O)[C@@H]1O)n1cnc2c(NC3CCC[C@H]3OCc3ccccc3)ncnc12
: