Target
Adenosine receptor A2
Ligand
BDBM99203
Substrate
Meas. Tech.
Binding Assay
Ki
9370±0.0 nM
Citation
 Jagtap, P Adenosine compounds and their use thereof US Patent  US8501708 Publication Date 8/6/2013 
Target
Name:
Adenosine receptor A2
Synonyms:
Adenosine A2a receptor
Type:
Protein
Mol. Mass.:
44661.95
Organism:
Oryctolagus cuniculus (rabbit)
Description:
XP_002722612 (sequence modified)
Residue:
409
  
Inhibitor
Name:
BDBM99203
Synonyms:
US8501708, 23
Type:
Small organic molecule
Emp. Form.:
C23H28ClN5O5
Mol. Mass.:
489.952
SMILES:
Cc1cccc(CO[C@H]2CCCC2Nc2nc(Cl)nc3n(cnc23)C2O[C@H](CO)[C@@H](O)[C@H]2O)c1
: