Target
Adenosine receptor A2
Ligand
BDBM99207
Substrate
Meas. Tech.
Binding Assay
Ki
3780±0.0 nM
Citation
 Jagtap, P Adenosine compounds and their use thereof US Patent  US8501708 Publication Date 8/6/2013 
Target
Name:
Adenosine receptor A2
Synonyms:
Adenosine A2a receptor
Type:
Protein
Mol. Mass.:
44661.95
Organism:
Oryctolagus cuniculus (rabbit)
Description:
XP_002722612 (sequence modified)
Residue:
409
  
Inhibitor
Name:
BDBM99207
Synonyms:
US8501708, 31
Type:
Small organic molecule
Emp. Form.:
C25H33N5O5
Mol. Mass.:
483.56
SMILES:
CC(C)c1ccc(CO[C@@H]2CCCC2Nc2ncnc3n(cnc23)[C@@H]2O[C@H](CO)[C@@H](O)[C@H]2O)cc1
: