Target
Monoglyceride lipase
Ligand
BDBM280602
Substrate
Meas. Tech.
In Vitro Competitive Activity-Based Protein Profiling
IC50
550±n/a nM
Citation
 Cisar, JSGrice, CAJones, TKWeber, ODBuzard, DJShaghafi, MB Spirocycle compounds and methods of making and using same US Patent  US10030020 Publication Date 7/24/2018 
Target
Name:
Monoglyceride lipase
Synonyms:
MAG lipase Mgll Monoglyceride Lipase (MGL)
Type:
Hydrolase
Mol. Mass.:
33391.67
Organism:
Mus musculus (mouse)
Description:
Assays were using membranes of recombinant MAG Lipase transiently transfected in COS-7 cells.
Residue:
303
  
Inhibitor
Name:
BDBM280602
Synonyms:
US10030020, Example 147 | US10781211, Example 147
Type:
Small organic molecule
Emp. Form.:
C25H33F6N3O2
Mol. Mass.:
521.5388
SMILES:
CC(C)N1CCc2cccc(CN3CCCC33CCN(CC3)C(=O)OC(C(F)(F)F)C(F)(F)F)c2C1
: