Target
Fatty-acid amide hydrolase 1
Ligand
BDBM280602
Substrate
Meas. Tech.
In Vitro Competitive Activity-Based Protein Profiling
IC50
>1000±n/a nM
Citation
 Cisar, JSGrice, CAJones, TKWeber, ODBuzard, DJShaghafi, MB Spirocycle compounds and methods of making and using same US Patent  US10030020 Publication Date 7/24/2018 
Target
Name:
Fatty-acid amide hydrolase 1
Synonyms:
Anandamide amidohydrolase FAAH1_MOUSE Faah1 Fatty-acid amide hydrolase (FAAH) Oleamide hydrolase 1
Type:
Hydrolase; single-pass membrane protein; homodimer
Mol. Mass.:
63227.28
Organism:
Mus musculus (mouse)
Description:
Mouse brain membranes were used in the assay.
Residue:
579
  
Inhibitor
Name:
BDBM280602
Synonyms:
US10030020, Example 147 | US10781211, Example 147
Type:
Small organic molecule
Emp. Form.:
C25H33F6N3O2
Mol. Mass.:
521.5388
SMILES:
CC(C)N1CCc2cccc(CN3CCCC33CCN(CC3)C(=O)OC(C(F)(F)F)C(F)(F)F)c2C1
: