Target
Serine/threonine-protein kinase PAK 4
Ligand
BDBM101507
Substrate
Meas. Tech.
Enzymatic Assay
Ki
21±n/a nM
EC50
778±0 nM
Citation
 Zhang, JGuo, CBouzida, DDong, LLi, HMarakovits, JTYang, AHong, Y Pyrrolopyrazoles, potent kinase inhibitors US Patent  US8530652 Publication Date 9/10/2013 
Target
Name:
Serine/threonine-protein kinase PAK 4
Synonyms:
KIAA1142 PAK4_HUMAN | p21-Activated kinase 4 (PAK4)
Type:
Protein
Mol. Mass.:
64098.01
Organism:
Homo sapiens (Human)
Description:
O96013
Residue:
591
  
Inhibitor
Name:
BDBM101507
Synonyms:
US8524710, 86 US8530652, 79
Type:
Small organic molecule
Emp. Form.:
C26H32N8O2
Mol. Mass.:
488.5847
SMILES:
Cc1nc(Nc2[nH]nc3c2CN(C(=O)N[C@@H]2C[C@H]2c2ccccc2)C3(C)C)cc(n1)N1CCOCC1
: