Target
Deoxyuridine 5'-triphosphate nucleotidohydrolase, mitochondrial
Ligand
BDBM5563
Substrate
Meas. Tech.
Inhibition Assay
IC50
330±n/a nM
Citation
 Fukuoka, MYokogawa, TMiyahara, SMiyakoshi, HYano, WTaguchi, JTakao, Y Uracil compound or salt thereof having human deoxyuridine triphosphatase inhibitory activity US Patent  US8530490 Publication Date 9/10/2013 
Target
Name:
Deoxyuridine 5'-triphosphate nucleotidohydrolase, mitochondrial
Synonyms:
DUT Deoxyuridine 5'-triphosphate nucleotidohydrolase (dUTPase) dUTP pyrophosphatase
Type:
Enzyme
Mol. Mass.:
26574.03
Organism:
Homo sapiens (Human)
Description:
P33316
Residue:
252
  
Inhibitor
Name:
BDBM5563
Synonyms:
US8530490, 173 | US8530490, 175
Type:
Emp. Form.:
C21H29N3O6S
Mol. Mass.:
451.536
SMILES:
CC(C)(COCCCn1ccc(=O)[nH]c1=O)NS(=O)(=O)c1cccc(OCC2CC2)c1
: