Target
Deoxyuridine 5'-triphosphate nucleotidohydrolase, mitochondrial
Ligand
BDBM101909
Substrate
Meas. Tech.
Inhibition Assay
IC50
3.3e+2±n/a nM
Citation
 Fukuoka, MYokogawa, TMiyahara, SMiyakoshi, HYano, WTaguchi, JTakao, Y Uracil compound or salt thereof having human deoxyuridine triphosphatase inhibitory activity US Patent  US8530490 Publication Date 9/10/2013 
Target
Name:
Deoxyuridine 5'-triphosphate nucleotidohydrolase, mitochondrial
Synonyms:
DUT Deoxyuridine 5'-triphosphate nucleotidohydrolase (dUTPase) dUTP pyrophosphatase
Type:
Enzyme
Mol. Mass.:
26574.03
Organism:
Homo sapiens (Human)
Description:
P33316
Residue:
252
  
Inhibitor
Name:
BDBM101909
Synonyms:
US8530490, 1
Type:
Small orangic molecule
Emp. Form.:
C19H25N3O6S
Mol. Mass.:
423.483
SMILES:
O=c1ccn(COCCCS(=O)(=O)NCc2cccc(OCC3CC3)c2)c(=O)[nH]1
: