Target
Deoxyuridine 5'-triphosphate nucleotidohydrolase, mitochondrial
Ligand
BDBM101749
Substrate
Meas. Tech.
Inhibition Assay
IC50
4e+1±n/a nM
Citation
 Fukuoka, MYokogawa, TMiyahara, SMiyakoshi, HYano, WTaguchi, JTakao, Y Uracil compound or salt thereof having human deoxyuridine triphosphatase inhibitory activity US Patent  US8530490 Publication Date 9/10/2013 
Target
Name:
Deoxyuridine 5'-triphosphate nucleotidohydrolase, mitochondrial
Synonyms:
DUT Deoxyuridine 5'-triphosphate nucleotidohydrolase (dUTPase) dUTP pyrophosphatase
Type:
Enzyme
Mol. Mass.:
26574.03
Organism:
Homo sapiens (Human)
Description:
P33316
Residue:
252
  
Inhibitor
Name:
BDBM101749
Synonyms:
US8530490, 9
Type:
Small organic molecule
Emp. Form.:
C22H30FN3O6S
Mol. Mass.:
483.554
SMILES:
CC(C)[C@@H](NS(=O)(=O)CCCOCn1ccc(=O)[nH]c1=O)c1ccc(F)c(OCC2CC2)c1
: