Target
Deoxyuridine 5'-triphosphate nucleotidohydrolase, mitochondrial
Ligand
BDBM101759
Substrate
Meas. Tech.
Inhibition Assay
IC50
2.4e+2±n/a nM
Citation
 Fukuoka, MYokogawa, TMiyahara, SMiyakoshi, HYano, WTaguchi, JTakao, Y Uracil compound or salt thereof having human deoxyuridine triphosphatase inhibitory activity US Patent  US8530490 Publication Date 9/10/2013 
Target
Name:
Deoxyuridine 5'-triphosphate nucleotidohydrolase, mitochondrial
Synonyms:
DUT Deoxyuridine 5'-triphosphate nucleotidohydrolase (dUTPase) dUTP pyrophosphatase
Type:
Enzyme
Mol. Mass.:
26574.03
Organism:
Homo sapiens (Human)
Description:
P33316
Residue:
252
  
Inhibitor
Name:
BDBM101759
Synonyms:
US8530490, 19
Type:
Small organic molecule
Emp. Form.:
C25H27F2N3O6S
Mol. Mass.:
535.56
SMILES:
Fc1ccc(cc1)C(NS(=O)(=O)CCCOCn1ccc(=O)[nH]c1=O)c1ccc(F)c(OCC2CC2)c1
: