Target
Deoxyuridine 5'-triphosphate nucleotidohydrolase, mitochondrial
Ligand
BDBM101779
Substrate
Meas. Tech.
Inhibition Assay
IC50
2.8e+2±n/a nM
Citation
 Fukuoka, MYokogawa, TMiyahara, SMiyakoshi, HYano, WTaguchi, JTakao, Y Uracil compound or salt thereof having human deoxyuridine triphosphatase inhibitory activity US Patent  US8530490 Publication Date 9/10/2013 
Target
Name:
Deoxyuridine 5'-triphosphate nucleotidohydrolase, mitochondrial
Synonyms:
DUT Deoxyuridine 5'-triphosphate nucleotidohydrolase (dUTPase) dUTP pyrophosphatase
Type:
Enzyme
Mol. Mass.:
26574.03
Organism:
Homo sapiens (Human)
Description:
P33316
Residue:
252
  
Inhibitor
Name:
BDBM101779
Synonyms:
US8530490, 39
Type:
Small organic molecule
Emp. Form.:
C23H31N3O6S
Mol. Mass.:
477.574
SMILES:
O=c1ccn(COCCCS(=O)(=O)NC2(CCCC2)c2cccc(OCC3CC3)c2)c(=O)[nH]1
: