Target
Deoxyuridine 5'-triphosphate nucleotidohydrolase, mitochondrial
Ligand
BDBM101780
Substrate
Meas. Tech.
Inhibition Assay
IC50
1.0e+2±n/a nM
Citation
 Fukuoka, MYokogawa, TMiyahara, SMiyakoshi, HYano, WTaguchi, JTakao, Y Uracil compound or salt thereof having human deoxyuridine triphosphatase inhibitory activity US Patent  US8530490 Publication Date 9/10/2013 
Target
Name:
Deoxyuridine 5'-triphosphate nucleotidohydrolase, mitochondrial
Synonyms:
DUT Deoxyuridine 5'-triphosphate nucleotidohydrolase (dUTPase) dUTP pyrophosphatase
Type:
Enzyme
Mol. Mass.:
26574.03
Organism:
Homo sapiens (Human)
Description:
P33316
Residue:
252
  
Inhibitor
Name:
BDBM101780
Synonyms:
US8530490, 40
Type:
Small organic molecule
Emp. Form.:
C22H28FN3O6S
Mol. Mass.:
481.538
SMILES:
Fc1ccc(cc1OCC1CC1)[C@H](NS(=O)(=O)CCCOCn1ccc(=O)[nH]c1=O)C1CC1
: